{"text_format":"3","workbook":"xlsx","n_sheets":6,"sheets":["Anleitung","Instructions","Eingabeblatt","Ausgabeblatt","Berechnung_Male","Berechnung_Female"],"not_rendered":{"images":2,"macros":1},"read":"whole","date_system":"1900"}

{"sheet":"Anleitung","index":0,"n_rows":50,"n_cols":3,"rows_kept":50}
[]
[null,"Anleitung zum Mirwald-Test zur Bestimmung des biologischen Entwicklungsstandes bei Mädchen und Knaben"]
[]
[null,"Stichwortartige Zusammenfassung des Testprotokolls"]
[]
[null," Körpergewicht"]
[null,"1.","Kalibrierte Waage verwenden – Nullmessung überprüfen"]
[null,"2.","Athlet/in mittig auf Waage, Gewicht auf beide Füsse gleichmässig verteilt"]
[null,"3.","Messung auf 0.1 kg genau"]
[null,"4.","Erneute Durchführung der Schritte 1 bis 3"]
[null,"5.","Falls Unterschied zw. 1. und 2. Messung maximal 0.4 kg, dann Durchschnitt als Ergebnis verwenden."]
[null,null,"Falls Unterschied grösser ist als 0.4 kg, dann wieder bei Punkt 1 beginnen."]
[]
[]
[]
[null,"Körpergrösse stehend"]
[null,"(in „gestreckter“ Haltung – maximale Distanz zwischen Boden und Scheitel des Kopfes. "]
[null,"Der Scheitel gilt dabei als höchster Punkt des Schädels, wenn der Kopf exakt horizontal gehalten wird)."]
[]
[null,"1.","Athlet/in steht mit Rücken, Gesäss und Fersen gegen die Wand. Füsse sind zusammen und flach auf dem Boden."]
{"$rows_left_out":31}
{"sheet":"Instructions","index":1,"n_rows":50,"n_cols":3,"rows_kept":50}
[]
[null,"Test Mirwald pour la détermination de l’état de développement biologique des garçons et des filles: guide de réalisation"]
[]
[null,"Le protocole de test en bref"]
[]
[null,"Poids corporel"]
[null,"1.       ","Utiliser une balance calibrée. Contrôler le zéro."]
[null,"2.      "," L’athlète doit se placer au milieu de la balance, son poids réparti équitablement sur ses deux pieds."]
[null,"3.       ","Mesurer le poids à 0,1 kg près."]
[null,"4.       ","Répéter les étapes 1 à 3"]
[null,"5.       ","Si les deux résultats divergent de moins de 0,4 kg, le résultat pris en compte sera la moyenne des deux valeurs. "]
[null,null,"Si l’écart entre les deux résultats est supérieur à 0,4 kg, recommencer à l’étape 1. "]
[]
[]
[]
[null,"Taille debout "]
[null,"(à mesurer en position «étendue», c’est-à-dire avec une distance maximale entre le sol et le sommet de la tête."]
[null,"Sommet de la tête = point du crâne le plus haut lorsque la tête est tenue exactement à l’horizontale)."]
[]
[null,"1.   ","L’athlète est debout, adossé au mur. Son dos, ses fesses et ses talons doivent toucher le mur. Ses pieds sont joints et posés à plat sur le sol."]
{"$rows_left_out":31}
{"sheet":"Eingabeblatt","index":2,"n_rows":500,"n_cols":25,"rows_kept":500}
[]
[]
[]
["Geschlecht\nsexe\nListe\nm=male\nf=female","Messdatum\nDate de la mesure","Name\nNom","Vorname\nPrénom","Geburtsdatum\nDate de naissance","Körpergewicht\nPoids\n(kg)","Körpergrösse stehend\nTaille debout\n(cm)","Körpergrösse sitzend\nTaille assise\n(cm)","Beinlänge\nLongueur des jambes\n(cm)","Alter Chronologisch\nÂge chronologique","Maturity Offset","geschätztes Alter beim Wachstumsspurt\nâge estimé au pic de croissance","Bio. Entwicklungsstand\nBES Zahl (1-3)\nDéveloppement bio.\nCatégorie 1-3","BES\nDév. bio. Catégorie 1-3","BES Zahl (1-5)\nDév. bio. Catégorie 1-5","BES Zahl (1-5)\nDév. Bio Catégorie 1-5","geschätzte Wachstumsreserve\nréserve de croissance estimée","geschätzte Erwachsenegrösse\nTaille à l'âge adulte estimée\n(±5.4cm)","Prozent-Erwachsenengrösse\npourcentage de la taille adulte atteinte actuellement",{"$nulls":3},"Spaltenangabe Tabelle"]
[{"$nulls":8},{"$f":"G5-H5","v":{"v":0,"d":"0.0"}},{"$f":"(B5-E5)/365.25","v":{"v":0,"d":"0.00"}},{"$f":"IF(A5=\"m\",(-9.236+(0.0002708*I5*H5)+(-0.001663*J5*I5)+(0.007216*J5*H5)+(0.02292*F5/G5*100)),(-9.376+(0.0001882*I5*H5)+(0.0022*J5*I5)+(0.005841*J5*H5)-(0.002658*J5*F5)+(0.07693*(F5/G5)*100)))","v":{"$error":"#DIV/0!"}},{"$f":"J5-K5","v":{"$error":"#DIV/0!"}},{"$f":"IF(A5=\"m\",(IF(L5<12.8,1,IF(L5>14.8,3,2))),(IF(L5<11,1,IF(L5>13,3,2))))","v":{"$error":"#DIV/0!"}},{"$f":"IF(M5=1,\"Früh / précoce\",IF(M5=2,\"Durchschnittlich / Normal\",\"Spät / Tardif\"))","v":{"$error":"#DIV/0!"}},{"$f":"IF(A5=\"m\",(IF(L5<12.8,1,IF(L5<13.3,2,IF(L5>14.8,5,IF(L5>14.3,4,3))))),(IF(L5<11,1,IF(L5<11.5,2,IF(L5>13,5,IF(L5>12.5,4,3))))))","v":{"$error":"#DIV/0!"}},{"$f":"IF(O5=1,\"Früh / précoce\",IF(O5=2,\"Möglicherweise Früh / éventuellement précoce\", IF(O5=3,\"Durchschnittlich / Normal\",IF(O5=4,\"Möglicherweise spät / éventuellement tardif\",\"Spät / Tardif\"))))","v":{"$error":"#DIV/0!"}},{"$f":"IF(A5=\"m\",VLOOKUP(K5,Berechnung_Male!$A$1:$D$42,W5,TRUE),VLOOKUP(Eingabeblatt!K5,Berechnung_Female!$A$1:$D$42,W5,TRUE))","v":{"$error":"#DIV/0!"}},{"$f":"G5+Q5","v":{"$error":"#DIV/0!"}},{"$f":"G5/R5","v":{"$error":"#DIV/0!"}},{"$nulls":3},{"$f":"IF(A5=\"m\",IF(L5<12.8,2,IF(L5<14.8,3,4)),IF(L5<11,2,IF(L5<13,3,4)))","v":{"$error":"#DIV/0!"}},null,"m"]
[{"$nulls":8},{"$f":"G6-H6","v":{"v":0,"d":"0.0"}},{"$f":"(B6-E6)/365.25","v":{"v":0,"d":"0.00"}},{"$f":"IF(A6=\"m\",(-9.236+(0.0002708*I6*H6)+(-0.001663*J6*I6)+(0.007216*J6*H6)+(0.02292*F6/G6*100)),(-9.376+(0.0001882*I6*H6)+(0.0022*J6*I6)+(0.005841*J6*H6)-(0.002658*J6*F6)+(0.07693*(F6/G6)*100)))","v":{"$error":"#DIV/0!"}},{"$f":"J6-K6","v":{"$error":"#DIV/0!"}},{"$f":"IF(A6=\"m\",(IF(L6<12.8,1,IF(L6>14.8,3,2))),(IF(L6<11,1,IF(L6>13,3,2))))","v":{"$error":"#DIV/0!"}},{"$f":"IF(M6=1,\"Früh / précoce\",IF(M6=2,\"Durchschnittlich / Normal\",\"Spät / Tardif\"))","v":{"$error":"#DIV/0!"}},{"$f":"IF(A6=\"m\",(IF(L6<12.8,1,IF(L6<13.3,2,IF(L6>14.8,5,IF(L6>14.3,4,3))))),(IF(L6<11,1,IF(L6<11.5,2,IF(L6>13,5,IF(L6>12.5,4,3))))))","v":{"$error":"#DIV/0!"}},{"$f":"IF(O6=1,\"Früh / précoce\",IF(O6=2,\"Möglicherweise Früh / éventuellement précoce\", IF(O6=3,\"Durchschnittlich / Normal\",IF(O6=4,\"Möglicherweise spät / éventuellement tardif\",\"Spät / Tardif\"))))","v":{"$error":"#DIV/0!"}},{"$f":"IF(A6=\"m\",VLOOKUP(K6,Berechnung_Male!$A$1:$D$42,W6,TRUE),VLOOKUP(Eingabeblatt!K6,Berechnung_Female!$A$1:$D$42,W6,TRUE))","v":{"$error":"#DIV/0!"}},{"$f":"G6+Q6","v":{"$error":"#DIV/0!"}},{"$f":"G6/R6","v":{"$error":"#DIV/0!"}},{"$nulls":3},{"$f":"IF(A6=\"m\",IF(L6<12.8,2,IF(L6<14.8,3,4)),IF(L6<11,2,IF(L6<13,3,4)))","v":{"$error":"#DIV/0!"}},null,"f"]
[{"$nulls":8},{"v":0,"d":"0.0"},{"v":0,"d":"0.00"},{"$error":"#DIV/0!"},{"$error":"#DIV/0!"},{"$error":"#DIV/0!"},{"$error":"#DIV/0!"},{"$error":"#DIV/0!"},{"$error":"#DIV/0!"},{"$f":"IF(A7=\"m\",VLOOKUP(K7,Berechnung_Male!$A$1:$D$42,W7,TRUE),VLOOKUP(Eingabeblatt!K7,Berechnung_Female!$A$1:$D$42,W7,TRUE))","v":{"$error":"#DIV/0!"}},{"$error":"#DIV/0!"},{"$error":"#DIV/0!"},{"$nulls":3},{"$error":"#DIV/0!"}]
[{"$nulls":8},{"v":0,"d":"0.0"},{"v":0,"d":"0.00"},{"$error":"#DIV/0!"},{"$error":"#DIV/0!"},{"$error":"#DIV/0!"},{"$error":"#DIV/0!"},{"$error":"#DIV/0!"},{"$error":"#DIV/0!"},{"$f":"IF(A8=\"m\",VLOOKUP(K8,Berechnung_Male!$A$1:$D$42,W8,TRUE),VLOOKUP(Eingabeblatt!K8,Berechnung_Female!$A$1:$D$42,W8,TRUE))","v":{"$error":"#DIV/0!"}},{"$error":"#DIV/0!"},{"$error":"#DIV/0!"},{"$nulls":3},{"$error":"#DIV/0!"}]
[{"$nulls":8},{"v":0,"d":"0.0"},{"v":0,"d":"0.00"},{"$error":"#DIV/0!"},{"$error":"#DIV/0!"},{"$error":"#DIV/0!"},{"$error":"#DIV/0!"},{"$error":"#DIV/0!"},{"$error":"#DIV/0!"},{"$f":"IF(A9=\"m\",VLOOKUP(K9,Berechnung_Male!$A$1:$D$42,W9,TRUE),VLOOKUP(Eingabeblatt!K9,Berechnung_Female!$A$1:$D$42,W9,TRUE))","v":{"$error":"#DIV/0!"}},{"$error":"#DIV/0!"},{"$error":"#DIV/0!"},{"$nulls":3},{"$error":"#DIV/0!"}]
[{"$nulls":8},{"v":0,"d":"0.0"},{"v":0,"d":"0.00"},{"$error":"#DIV/0!"},{"$error":"#DIV/0!"},{"$error":"#DIV/0!"},{"$error":"#DIV/0!"},{"$error":"#DIV/0!"},{"$error":"#DIV/0!"},{"$f":"IF(A10=\"m\",VLOOKUP(K10,Berechnung_Male!$A$1:$D$42,W10,TRUE),VLOOKUP(Eingabeblatt!K10,Berechnung_Female!$A$1:$D$42,W10,TRUE))","v":{"$error":"#DIV/0!"}},{"$error":"#DIV/0!"},{"$error":"#DIV/0!"},{"$nulls":3},{"$error":"#DIV/0!"}]
[{"$nulls":8},{"v":0,"d":"0.0"},{"v":0,"d":"0.00"},{"$error":"#DIV/0!"},{"$error":"#DIV/0!"},{"$error":"#DIV/0!"},{"$error":"#DIV/0!"},{"$error":"#DIV/0!"},{"$error":"#DIV/0!"},{"$f":"IF(A11=\"m\",VLOOKUP(K11,Berechnung_Male!$A$1:$D$42,W11,TRUE),VLOOKUP(Eingabeblatt!K11,Berechnung_Female!$A$1:$D$42,W11,TRUE))","v":{"$error":"#DIV/0!"}},{"$error":"#DIV/0!"},{"$error":"#DIV/0!"},{"$nulls":3},{"$error":"#DIV/0!"}]
[{"$nulls":8},{"v":0,"d":"0.0"},{"v":0,"d":"0.00"},{"$error":"#DIV/0!"},{"$error":"#DIV/0!"},{"$error":"#DIV/0!"},{"$error":"#DIV/0!"},{"$error":"#DIV/0!"},{"$error":"#DIV/0!"},{"$f":"IF(A12=\"m\",VLOOKUP(K12,Berechnung_Male!$A$1:$D$42,W12,TRUE),VLOOKUP(Eingabeblatt!K12,Berechnung_Female!$A$1:$D$42,W12,TRUE))","v":{"$error":"#DIV/0!"}},{"$error":"#DIV/0!"},{"$error":"#DIV/0!"},{"$nulls":3},{"$error":"#DIV/0!"}]
[{"$nulls":8},{"v":0,"d":"0.0"},{"v":0,"d":"0.00"},{"$error":"#DIV/0!"},{"$error":"#DIV/0!"},{"$error":"#DIV/0!"},{"$error":"#DIV/0!"},{"$error":"#DIV/0!"},{"$error":"#DIV/0!"},{"$f":"IF(A13=\"m\",VLOOKUP(K13,Berechnung_Male!$A$1:$D$42,W13,TRUE),VLOOKUP(Eingabeblatt!K13,Berechnung_Female!$A$1:$D$42,W13,TRUE))","v":{"$error":"#DIV/0!"}},{"$error":"#DIV/0!"},{"$error":"#DIV/0!"},{"$nulls":3},{"$error":"#DIV/0!"}]
[{"$nulls":8},{"v":0,"d":"0.0"},{"v":0,"d":"0.00"},{"$error":"#DIV/0!"},{"$error":"#DIV/0!"},{"$error":"#DIV/0!"},{"$error":"#DIV/0!"},{"$error":"#DIV/0!"},{"$error":"#DIV/0!"},{"$f":"IF(A14=\"m\",VLOOKUP(K14,Berechnung_Male!$A$1:$D$42,W14,TRUE),VLOOKUP(Eingabeblatt!K14,Berechnung_Female!$A$1:$D$42,W14,TRUE))","v":{"$error":"#DIV/0!"}},{"$error":"#DIV/0!"},{"$error":"#DIV/0!"},{"$nulls":3},{"$error":"#DIV/0!"}]
[{"$nulls":8},{"v":0,"d":"0.0"},{"v":0,"d":"0.00"},{"$error":"#DIV/0!"},{"$error":"#DIV/0!"},{"$error":"#DIV/0!"},{"$error":"#DIV/0!"},{"$error":"#DIV/0!"},{"$error":"#DIV/0!"},{"$f":"IF(A15=\"m\",VLOOKUP(K15,Berechnung_Male!$A$1:$D$42,W15,TRUE),VLOOKUP(Eingabeblatt!K15,Berechnung_Female!$A$1:$D$42,W15,TRUE))","v":{"$error":"#DIV/0!"}},{"$error":"#DIV/0!"},{"$error":"#DIV/0!"},{"$nulls":3},{"$error":"#DIV/0!"}]
[{"$nulls":8},{"v":0,"d":"0.0"},{"v":0,"d":"0.00"},{"$error":"#DIV/0!"},{"$error":"#DIV/0!"},{"$error":"#DIV/0!"},{"$error":"#DIV/0!"},{"$error":"#DIV/0!"},{"$error":"#DIV/0!"},{"$f":"IF(A16=\"m\",VLOOKUP(K16,Berechnung_Male!$A$1:$D$42,W16,TRUE),VLOOKUP(Eingabeblatt!K16,Berechnung_Female!$A$1:$D$42,W16,TRUE))","v":{"$error":"#DIV/0!"}},{"$error":"#DIV/0!"},{"$error":"#DIV/0!"},{"$nulls":3},{"$error":"#DIV/0!"}]
[{"$nulls":8},{"v":0,"d":"0.0"},{"v":0,"d":"0.00"},{"$error":"#DIV/0!"},{"$error":"#DIV/0!"},{"$error":"#DIV/0!"},{"$error":"#DIV/0!"},{"$error":"#DIV/0!"},{"$error":"#DIV/0!"},{"$f":"IF(A17=\"m\",VLOOKUP(K17,Berechnung_Male!$A$1:$D$42,W17,TRUE),VLOOKUP(Eingabeblatt!K17,Berechnung_Female!$A$1:$D$42,W17,TRUE))","v":{"$error":"#DIV/0!"}},{"$error":"#DIV/0!"},{"$error":"#DIV/0!"},{"$nulls":3},{"$error":"#DIV/0!"}]
[{"$nulls":8},{"v":0,"d":"0.0"},{"v":0,"d":"0.00"},{"$error":"#DIV/0!"},{"$error":"#DIV/0!"},{"$error":"#DIV/0!"},{"$error":"#DIV/0!"},{"$error":"#DIV/0!"},{"$error":"#DIV/0!"},{"$f":"IF(A18=\"m\",VLOOKUP(K18,Berechnung_Male!$A$1:$D$42,W18,TRUE),VLOOKUP(Eingabeblatt!K18,Berechnung_Female!$A$1:$D$42,W18,TRUE))","v":{"$error":"#DIV/0!"}},{"$error":"#DIV/0!"},{"$error":"#DIV/0!"},{"$nulls":3},{"$error":"#DIV/0!"}]
[{"$nulls":8},{"v":0,"d":"0.0"},{"v":0,"d":"0.00"},{"$error":"#DIV/0!"},{"$error":"#DIV/0!"},{"$error":"#DIV/0!"},{"$error":"#DIV/0!"},{"$error":"#DIV/0!"},{"$error":"#DIV/0!"},{"$f":"IF(A19=\"m\",VLOOKUP(K19,Berechnung_Male!$A$1:$D$42,W19,TRUE),VLOOKUP(Eingabeblatt!K19,Berechnung_Female!$A$1:$D$42,W19,TRUE))","v":{"$error":"#DIV/0!"}},{"$error":"#DIV/0!"},{"$error":"#DIV/0!"},{"$nulls":3},{"$error":"#DIV/0!"}]
[{"$nulls":8},{"v":0,"d":"0.0"},{"v":0,"d":"0.00"},{"$error":"#DIV/0!"},{"$error":"#DIV/0!"},{"$error":"#DIV/0!"},{"$error":"#DIV/0!"},{"$error":"#DIV/0!"},{"$error":"#DIV/0!"},{"$f":"IF(A20=\"m\",VLOOKUP(K20,Berechnung_Male!$A$1:$D$42,W20,TRUE),VLOOKUP(Eingabeblatt!K20,Berechnung_Female!$A$1:$D$42,W20,TRUE))","v":{"$error":"#DIV/0!"}},{"$error":"#DIV/0!"},{"$error":"#DIV/0!"},{"$nulls":3},{"$error":"#DIV/0!"}]
{"$rows_left_out":481}
{"sheet":"Ausgabeblatt","index":3,"n_rows":200,"n_cols":5,"rows_kept":200}
["Name\nNom","Vorname\nPrénom","Geburtsdatum\nDate de naissance","Messdatum\nDate de la mesure","Bio. Entwicklungsstand\nBES Zahl (1-3)\nDéveloppement bio.\nCatégorie 1-3"]
[{"$f":"IF(Eingabeblatt!C5=\"\",\"\",Eingabeblatt!C5)","v":""},{"$f":"IF(Eingabeblatt!D5=\"\",\"\",Eingabeblatt!D5)","v":""},{"$f":"IF(Eingabeblatt!E5=\"\",\"\",Eingabeblatt!E5)","v":""},{"$f":"IF(Eingabeblatt!B5=\"\",\"\",Eingabeblatt!B5)","v":""},{"$f":"Eingabeblatt!M5","v":{"$error":"#DIV/0!"}}]
[{"$f":"IF(Eingabeblatt!C6=\"\",\"\",Eingabeblatt!C6)","v":""},{"$f":"IF(Eingabeblatt!D6=\"\",\"\",Eingabeblatt!D6)","v":""},{"$f":"IF(Eingabeblatt!E6=\"\",\"\",Eingabeblatt!E6)","v":""},{"$f":"IF(Eingabeblatt!B6=\"\",\"\",Eingabeblatt!B6)","v":""},{"$f":"Eingabeblatt!M6","v":{"$error":"#DIV/0!"}}]
[{"$f":"IF(Eingabeblatt!C7=\"\",\"\",Eingabeblatt!C7)","v":""},{"$f":"IF(Eingabeblatt!D7=\"\",\"\",Eingabeblatt!D7)","v":""},{"$f":"IF(Eingabeblatt!E7=\"\",\"\",Eingabeblatt!E7)","v":""},{"$f":"IF(Eingabeblatt!B7=\"\",\"\",Eingabeblatt!B7)","v":""},{"$f":"Eingabeblatt!M7","v":{"$error":"#DIV/0!"}}]
[{"$f":"IF(Eingabeblatt!C8=\"\",\"\",Eingabeblatt!C8)","v":""},{"$f":"IF(Eingabeblatt!D8=\"\",\"\",Eingabeblatt!D8)","v":""},{"$f":"IF(Eingabeblatt!E8=\"\",\"\",Eingabeblatt!E8)","v":""},{"$f":"IF(Eingabeblatt!B8=\"\",\"\",Eingabeblatt!B8)","v":""},{"$f":"Eingabeblatt!M8","v":{"$error":"#DIV/0!"}}]
[{"$f":"IF(Eingabeblatt!C9=\"\",\"\",Eingabeblatt!C9)","v":""},{"$f":"IF(Eingabeblatt!D9=\"\",\"\",Eingabeblatt!D9)","v":""},{"$f":"IF(Eingabeblatt!E9=\"\",\"\",Eingabeblatt!E9)","v":""},{"$f":"IF(Eingabeblatt!B9=\"\",\"\",Eingabeblatt!B9)","v":""},{"$f":"Eingabeblatt!M9","v":{"$error":"#DIV/0!"}}]
[{"$f":"IF(Eingabeblatt!C10=\"\",\"\",Eingabeblatt!C10)","v":""},{"$f":"IF(Eingabeblatt!D10=\"\",\"\",Eingabeblatt!D10)","v":""},{"$f":"IF(Eingabeblatt!E10=\"\",\"\",Eingabeblatt!E10)","v":""},{"$f":"IF(Eingabeblatt!B10=\"\",\"\",Eingabeblatt!B10)","v":""},{"$f":"Eingabeblatt!M10","v":{"$error":"#DIV/0!"}}]
[{"$f":"IF(Eingabeblatt!C11=\"\",\"\",Eingabeblatt!C11)","v":""},{"$f":"IF(Eingabeblatt!D11=\"\",\"\",Eingabeblatt!D11)","v":""},{"$f":"IF(Eingabeblatt!E11=\"\",\"\",Eingabeblatt!E11)","v":""},{"$f":"IF(Eingabeblatt!B11=\"\",\"\",Eingabeblatt!B11)","v":""},{"$f":"Eingabeblatt!M11","v":{"$error":"#DIV/0!"}}]
[{"$f":"IF(Eingabeblatt!C12=\"\",\"\",Eingabeblatt!C12)","v":""},{"$f":"IF(Eingabeblatt!D12=\"\",\"\",Eingabeblatt!D12)","v":""},{"$f":"IF(Eingabeblatt!E12=\"\",\"\",Eingabeblatt!E12)","v":""},{"$f":"IF(Eingabeblatt!B12=\"\",\"\",Eingabeblatt!B12)","v":""},{"$f":"Eingabeblatt!M12","v":{"$error":"#DIV/0!"}}]
[{"$f":"IF(Eingabeblatt!C13=\"\",\"\",Eingabeblatt!C13)","v":""},{"$f":"IF(Eingabeblatt!D13=\"\",\"\",Eingabeblatt!D13)","v":""},{"$f":"IF(Eingabeblatt!E13=\"\",\"\",Eingabeblatt!E13)","v":""},{"$f":"IF(Eingabeblatt!B13=\"\",\"\",Eingabeblatt!B13)","v":""},{"$f":"Eingabeblatt!M13","v":{"$error":"#DIV/0!"}}]
[{"$f":"IF(Eingabeblatt!C14=\"\",\"\",Eingabeblatt!C14)","v":""},{"$f":"IF(Eingabeblatt!D14=\"\",\"\",Eingabeblatt!D14)","v":""},{"$f":"IF(Eingabeblatt!E14=\"\",\"\",Eingabeblatt!E14)","v":""},{"$f":"IF(Eingabeblatt!B14=\"\",\"\",Eingabeblatt!B14)","v":""},{"$f":"Eingabeblatt!M14","v":{"$error":"#DIV/0!"}}]
[{"$f":"IF(Eingabeblatt!C15=\"\",\"\",Eingabeblatt!C15)","v":""},{"$f":"IF(Eingabeblatt!D15=\"\",\"\",Eingabeblatt!D15)","v":""},{"$f":"IF(Eingabeblatt!E15=\"\",\"\",Eingabeblatt!E15)","v":""},{"$f":"IF(Eingabeblatt!B15=\"\",\"\",Eingabeblatt!B15)","v":""},{"$f":"Eingabeblatt!M15","v":{"$error":"#DIV/0!"}}]
[{"$f":"IF(Eingabeblatt!C16=\"\",\"\",Eingabeblatt!C16)","v":""},{"$f":"IF(Eingabeblatt!D16=\"\",\"\",Eingabeblatt!D16)","v":""},{"$f":"IF(Eingabeblatt!E16=\"\",\"\",Eingabeblatt!E16)","v":""},{"$f":"IF(Eingabeblatt!B16=\"\",\"\",Eingabeblatt!B16)","v":""},{"$f":"Eingabeblatt!M16","v":{"$error":"#DIV/0!"}}]
[{"$f":"IF(Eingabeblatt!C17=\"\",\"\",Eingabeblatt!C17)","v":""},{"$f":"IF(Eingabeblatt!D17=\"\",\"\",Eingabeblatt!D17)","v":""},{"$f":"IF(Eingabeblatt!E17=\"\",\"\",Eingabeblatt!E17)","v":""},{"$f":"IF(Eingabeblatt!B17=\"\",\"\",Eingabeblatt!B17)","v":""},{"$f":"Eingabeblatt!M17","v":{"$error":"#DIV/0!"}}]
[{"$f":"IF(Eingabeblatt!C18=\"\",\"\",Eingabeblatt!C18)","v":""},{"$f":"IF(Eingabeblatt!D18=\"\",\"\",Eingabeblatt!D18)","v":""},{"$f":"IF(Eingabeblatt!E18=\"\",\"\",Eingabeblatt!E18)","v":""},{"$f":"IF(Eingabeblatt!B18=\"\",\"\",Eingabeblatt!B18)","v":""},{"$f":"Eingabeblatt!M18","v":{"$error":"#DIV/0!"}}]
[{"$f":"IF(Eingabeblatt!C19=\"\",\"\",Eingabeblatt!C19)","v":""},{"$f":"IF(Eingabeblatt!D19=\"\",\"\",Eingabeblatt!D19)","v":""},{"$f":"IF(Eingabeblatt!E19=\"\",\"\",Eingabeblatt!E19)","v":""},{"$f":"IF(Eingabeblatt!B19=\"\",\"\",Eingabeblatt!B19)","v":""},{"$f":"Eingabeblatt!M19","v":{"$error":"#DIV/0!"}}]
[{"$f":"IF(Eingabeblatt!C20=\"\",\"\",Eingabeblatt!C20)","v":""},{"$f":"IF(Eingabeblatt!D20=\"\",\"\",Eingabeblatt!D20)","v":""},{"$f":"IF(Eingabeblatt!E20=\"\",\"\",Eingabeblatt!E20)","v":""},{"$f":"IF(Eingabeblatt!B20=\"\",\"\",Eingabeblatt!B20)","v":""},{"$f":"Eingabeblatt!M20","v":{"$error":"#DIV/0!"}}]
[{"$f":"IF(Eingabeblatt!C21=\"\",\"\",Eingabeblatt!C21)","v":""},{"$f":"IF(Eingabeblatt!D21=\"\",\"\",Eingabeblatt!D21)","v":""},{"$f":"IF(Eingabeblatt!E21=\"\",\"\",Eingabeblatt!E21)","v":""},{"$f":"IF(Eingabeblatt!B21=\"\",\"\",Eingabeblatt!B21)","v":""},{"$f":"Eingabeblatt!M21","v":{"$error":"#DIV/0!"}}]
[{"$f":"IF(Eingabeblatt!C22=\"\",\"\",Eingabeblatt!C22)","v":""},{"$f":"IF(Eingabeblatt!D22=\"\",\"\",Eingabeblatt!D22)","v":""},{"$f":"IF(Eingabeblatt!E22=\"\",\"\",Eingabeblatt!E22)","v":""},{"$f":"IF(Eingabeblatt!B22=\"\",\"\",Eingabeblatt!B22)","v":""},{"$f":"Eingabeblatt!M22","v":{"$error":"#DIV/0!"}}]
[{"$f":"IF(Eingabeblatt!C23=\"\",\"\",Eingabeblatt!C23)","v":""},{"$f":"IF(Eingabeblatt!D23=\"\",\"\",Eingabeblatt!D23)","v":""},{"$f":"IF(Eingabeblatt!E23=\"\",\"\",Eingabeblatt!E23)","v":""},{"$f":"IF(Eingabeblatt!B23=\"\",\"\",Eingabeblatt!B23)","v":""},{"$f":"Eingabeblatt!M23","v":{"$error":"#DIV/0!"}}]
{"$rows_left_out":181}
{"sheet":"Berechnung_Male","index":4,"n_rows":55,"n_cols":6,"rows_kept":55,"hidden":true,"merged":[[51,0,51,2],[54,0,57,3]]}
["Year from PHV","early","average","late"]
[-4,45.29,40.09,34.73,null,"männlich"]
[-3.8,44.21,39.08,33.83]
[-3.6,43.11,38.07,32.94]
[-3.4,41.99,37.06,32.05]
[-3.2,40.85,36.05,31.16]
[-3,39.69,35.04,30.27]
[-2.8,38.52,34.04,29.38]
[-2.6,37.33,33.05,28.49]
[-2.4,36.15,32.06,27.6]
[-2.2,34.97,31.07,26.7]
[-2,33.8,30.06,25.77]
[-1.8,32.62,29.03,24.79]
[-1.6,31.44,27.95,23.74]
[-1.4,30.23,26.83,22.63]
[-1.2,28.98,25.63,21.45]
[-1,27.66,24.36,20.22]
[-0.8,26.24,22.99,18.96]
[-0.6,24.68,21.51,17.68]
[-0.4,22.96,19.88,16.31]
{"$rows_left_out":36}
{"sheet":"Berechnung_Female","index":5,"n_rows":55,"n_cols":6,"rows_kept":55,"hidden":true,"merged":[[51,0,51,2],[54,0,57,3]]}
["Year from PHV","early","average","late"]
[-4,42.61,38.81,34.35,null,"weiblich"]
[-3.8,41.49,37.67,33.27]
[-3.6,40.39,36.55,32.2]
[-3.4,39.3,35.44,31.14]
[-3.2,38.21,34.34,30.09]
[-3,37.13,33.25,29.04]
[-2.8,36.04,32.16,27.99]
[-2.6,34.94,31.04,26.93]
[-2.4,33.82,29.91,25.87]
[-2.2,32.68,28.76,24.79]
[-2,31.53,27.58,23.71]
[-1.8,30.44,26.39,22.63]
[-1.6,29.36,25.21,21.55]
[-1.4,28.24,24.03,20.47]
[-1.2,27.09,22.85,19.37]
[-1,25.87,21.66,18.25]
[-0.8,24.54,20.44,17.07]
[-0.6,23.09,19.16,15.81]
[-0.4,21.5,17.8,14.44]
{"$rows_left_out":35}